{"text_format":"1","workbook":"xlsx","n_sheets":6,"sheets":["請求書作成システム","入力様式","出力様式","データベース","処理シート","短縮"],"not_rendered":{"charts":0,"images":7,"macros":1,"external_links":0,"defined_names":2,"comments":0,"pivot_tables":0},"unopened":[],"bounds":{"document_bytes":16777216,"sheet_cells":100000,"rows_first":2000,"rows_last":500,"rows_between":2000,"halvings":0,"cell_chars":16384,"cell_head_chars":4096},"cells_cut":0,"cells_raw":0,"read":"whole","date_system":"1900"}

{"sheet":"請求書作成システム","index":0,"n_rows":35,"n_cols":12,"rows_kept":35,"cut":false,"hidden":false,"merged":[]}
[]
[null,null,null,null,null,null,null,null,null,null,null,"Ver.2.6"]
[null,null,null,null,null,null,null,null,null,"②消費税(通常)","③消費税(軽減税率)","④消費税(旧)"]
[null,"①",null,null,null,"←最初に入力してください。",null,null,null,10,8,8]
[]
[null,"②",null,null,null,"←適宜、品名、件名等の一覧を作成してください。"]
[]
[null,"③",null,null,null,"←納品時に入力してください。"]
[]
[null,"④",null,null,null,"←月末に印刷、発注部門（担当営業所 or 支店 等）に送付ください。"]
[]
[null,"⑤",null,null,null,"←変更した場合、必ず保存して終了してください。"]
[]
["修正履歴"]
["Ver.",2.6,"2019-09-17","消費税改正対応（単価・数量の小数は非対応）"]
["Ver.",2.5099999999999998,"2017-04-26","ロゴマークを変更（希望者のみに配布）"]
["Ver.",2.5,"2015-06-15","単価・数量を小数第4位まで入力可能に変更。基本事項入力で小数桁数を任意に変更出来るように改善。（希望者のみに配布）"]
["Ver.",2.41,"2017-04-26","ロゴマークを変更"]
["Ver.",2.4,"2015-06-03","対象月に品目が1件も無い場合でも、前月繰越金のみの請求書が印刷出来るように修正。"]
["Ver.",2.2999999999999998,"2014-09-26","伝票No.が同じ納品伝票がある場合に印刷データが誤りとなる不具合を修正。"]
[null,null,null,"伝票No.が同じ納品伝票を編集出来ない不具合を修正。"]
[null,null,null,"納品伝票新規入力時に伝票No.を自動入力するように改善。"]
[null,null,null,"納品伝票変更時に件名が長くならないように改善。"]
["Ver.",2.2000000000000002,"2014-09-26","伝票No.が同じ納品伝票がある場合に空白行になる不具合を修正。"]
["Ver.",2.1,"2014-09-25","伝票No.の桁数が不揃いの場合に空白行になる不具合を修正。"]
[null,null,null,"複数ページになった場合には前月繰越金額を1ページ目のみとするように修正。"]
["Ver.",2,"2014-09-22","消費税非課税品目に対応。"]
[null,null,null,"調整額に対応。"]
[null,null,null,"単価・数量を小数第2位まで入力可能に変更。"]
[null,null,null,"取引先コードの右側に発注部門を印刷するように変更。"]
{"$rows_left_out":6}
{"sheet":"入力様式","index":1,"n_rows":34,"n_cols":18,"rows_kept":34,"cut":false,"hidden":true,"merged":[[29,7,29,9],[29,13,29,14],[29,15,29,16],[30,7,30,9],[30,13,30,14],[30,15,30,16],[33,13,33,14],[31,7,31,9],[31,13,31,14],[31,15,31,16],[32,7,32,9],[32,13,32,14],[32,15,32,16],[27,15,27,16],[28,7,28,9],[28,13,28,14],[28,15,28,16],[23,13,23,14],[23,15,23,16],[24,7,24,9],[24,13,24,14],[24,15,24,16],[27,7,27,9],[27,13,27,14],[25,1,25,2],[25,7,25,9],[25,13,25,14],[25,15,25,16],[26,1,26,2],[26,7,26,9],[26,13,26,14],[26,15,26,16],[17,7,17,8],[22,1,24,2],[22,7,22,9],[22,13,22,14],[22,15,22,16],[23,7,23,9],[18,7,18,8],[8,7,8,8],[3,1,3,2],[3,3,3,5],[2,9,2,11],[3,14,3,16],[4,1,4,2],[4,3,4,5],[3,7,3,8],[4,7,4,8],[4,9,4,11],[7,7,7,8],[4,14,4,16],[5,7,5,8],[5,9,5,11],[8,14,8,16],[8,9,8,11],[5,14,5,16],[6,14,6,16],[7,14,7,16],[7,9,7,11],[1,1,1,2],[1,3,1,5],[1,9,1,11],[1,14,1,16],[2,1,2,2],[2,3,2,5],[1,7,1,8],[2,7,2,8],[2,14,2,16],[13,7,13,8],[13,9,13,11],[14,7,14,8],[15,7,15,8],[15,9,15,11],[9,7,9,8],[10,7,10,8],[10,9,10,11],[12,7,12,8],[12,9,12,11]]}
[null,"現場名・担当者など",null,null,null,null,null,"振込先①",null,null,null,null,null,"請求者"]
[null,"発注部門",null,{"$f":"データベース!E3","v":"サンプル"},null,null,null,"金融機関",null,null,null,null,null,"郵便番号",""]
[null,"現場名",null,{"$f":"データベース!F3","v":"サンプル"},null,null,null,"支店",null,null,null,null,null,"住所"]
[null,"工事番号",null,{"$f":"データベース!G3","v":"0123-4567-8901"},null,null,null,"預金種別",null,1,null,{"$f":"IF(J4=0,\"\",IF(J4=1,\"普通\",\"当座\"))","v":"普通"},null,"会社名"]
[null,"現場担当者",null,{"$f":"データベース!H3","v":"サンプル"},null,null,null,"口座番号",null,"",null,null,null,"部門"]
[null,null,null,null,null,null,null,"口座名義",null,null,null,null,null,"担当者名"]
[null,null,null,null,null,null,null,"振込先②",null,null,null,null,null,"電話",""]
[null,null,null,null,null,null,null,"金融機関",null,null,null,null,null,"FAX",""]
[null,null,null,null,null,null,null,"支店",null,null,null,null,null,"取引先コード"]
[null,null,null,null,null,null,null,"預金種別",null,0,null,{"$f":"IF(J10=0,\"\",IF(J10=1,\"普通\",\"当座\"))","v":""},null,"請求先",1,null,null,{"$f":"IF(O10=0,\"\",IF(O10=1,\"福井\",IF(O10=2,\"大野\",IF(O10=3,\"真岡\",\"\"))))","v":"福井"}]
[null,null,null,null,null,null,null,"口座番号",null,""]
[null,null,null,null,null,null,null,"振込先③"]
[null,null,null,null,null,null,null,"金融機関"]
[null,null,null,null,null,null,null,"支店"]
[null,null,null,null,null,null,null,"預金種別",null,0,null,{"$f":"IF(J15=0,\"\",IF(J15=1,\"普通\",\"当座\"))","v":""}]
[null,null,null,null,null,null,null,"口座番号",null,""]
[]
[null,null,null,null,null,null,null,"消費税区分",null,true,{"$f":"IF(J18=TRUE,FALSE,TRUE)","v":false}]
[null,null,null,null,null,null,null,"消費税課税",null,true,false,false,false]
[]
[]
[null,"請求書日付",null,null,null,null,"請求項目"]
[null,"年月日\n（西暦）",null,{"$f":"データベース!I3","v":2019},"年",null,"№","品名",null,null,"数量","課税","単価","金額",null,"備考",null,"課税金額"]
[null,null,null,{"$f":"データベース!J3","v":9},"月",null,1,{"$f":"データベース!L3","v":"サンプル"},null,null,{"$f":"VALUE(データベース!M3)","v":1},{"$f":"IF(データベース!N3=0,\"\",データベース!N3)","v":""},{"$f":"VALUE(データベース!O3)","v":1000},{"$f":"IF(K24=\"\",\"\",INT(K24*M24))","v":1000},null,{"$f":"IF(L24=\"非課税\",L24 & \" \",\"\") & IF(データベース!P3=0,\"\",データベース!P3)","v":""},null,{"$f":"IF(K24=\"\",\"\",IF(L24=\"非課税\",\"\",INT(K24*M24)))","v":1000}]
[null,null,null,{"$f":"データベース!K3","v":1},"日",null,2,{"$f":"データベース!Q3","v":"サンプル"},null,null,{"$f":"VALUE(データベース!R3)","v":2},{"$f":"IF(データベース!S3=0,\"\",データベース!S3)","v":""},{"$f":"VALUE(データベース!T3)","v":10},20,null,{"$f":"IF(L25=\"非課税\",L25 & \" \",\"\") & IF(データベース!U3=0,\"\",データベース!U3)","v":""},null,{"$f":"IF(K25=\"\",\"\",IF(L25=\"非課税\",\"\",INT(K25*M25)))","v":20}]
[null,"請求対象月",null,{"$f":"D24","v":9},"月分",null,3,{"$f":"データベース!V3","v":"サンプル"},null,null,{"$f":"VALUE(データベース!W3)","v":3},{"$f":"IF(データベース!X3=0,\"\",データベース!X3)","v":""},{"$f":"VALUE(データベース!Y3)","v":10},30,null,{"$f":"IF(L26=\"非課税\",L26 & \" \",\"\") & IF(データベース!Z3=0,\"\",データベース!Z3)","v":""},null,30]
[null,"納品書印刷",null,true,{"$f":"IF(D27=TRUE,FALSE,TRUE)","v":false},null,4,{"$f":"データベース!AA3","v":"サンプル"},null,null,{"$f":"VALUE(データベース!AB3)","v":4},{"$f":"IF(データベース!AC3=0,\"\",データベース!AC3)","v":""},{"$f":"VALUE(データベース!AD3)","v":10},40,null,{"$f":"IF(L27=\"非課税\",L27 & \" \",\"\") & IF(データベース!AE3=0,\"\",データベース!AE3)","v":""},null,40]
[null,null,null,null,null,null,5,{"$f":"データベース!AF3","v":"サンプル"},null,null,{"$f":"VALUE(データベース!AG3)","v":5},{"$f":"IF(データベース!AH3=0,\"\",データベース!AH3)","v":""},{"$f":"VALUE(データベース!AI3)","v":10},50,null,{"$f":"IF(L28=\"非課税\",L28 & \" \",\"\") & IF(データベース!AJ3=0,\"\",データベース!AJ3)","v":""},null,50]
[null,null,null,null,null,null,6,{"$f":"データベース!AK3","v":"サンプル"},null,null,{"$f":"VALUE(データベース!AL3)","v":6},{"$f":"IF(データベース!AM3=0,\"\",データベース!AM3)","v":""},{"$f":"VALUE(データベース!AN3)","v":10},60,null,{"$f":"IF(L29=\"非課税\",L29 & \" \",\"\") & IF(データベース!AO3=0,\"\",データベース!AO3)","v":""},null,60]
[null,null,null,null,null,null,7,{"$f":"データベース!AP3","v":"サンプル"},null,null,{"$f":"VALUE(データベース!AQ3)","v":7},{"$f":"IF(データベース!AR3=0,\"\",データベース!AR3)","v":""},{"$f":"VALUE(データベース!AS3)","v":10},70,null,{"$f":"IF(L30=\"非課税\",L30 & \" \",\"\") & IF(データベース!AT3=0,\"\",データベース!AT3)","v":""},null,70]
{"$rows_left_out":5}
{"sheet":"出力様式","index":2,"n_rows":60,"n_cols":18,"rows_kept":60,"cut":false,"hidden":true,"merged":[[53,0,53,1],[53,2,53,3],[53,6,53,7],[54,2,54,3],[54,4,54,5],[54,6,54,7],[55,2,55,3],[55,4,55,5],[55,6,55,7],[56,2,56,3],[56,4,56,5],[56,6,56,7],[57,2,57,3],[57,4,57,5],[15,6,15,10],[16,6,16,10],[13,6,13,10],[57,6,57,7],[18,2,18,3],[22,3,22,5],[32,3,32,5],[50,3,50,5],[41,3,41,5],[37,3,37,5],[38,3,38,5],[39,3,39,5],[40,3,40,5],[42,3,42,5],[3,6,3,10],[4,6,4,10],[5,6,5,10],[6,6,6,10],[7,6,7,10],[8,6,8,10],[4,3,4,4],[17,6,17,10],[9,6,9,10],[11,6,11,10],[12,6,12,10],[14,6,14,10],[33,3,33,5],[4,0,4,2],[13,2,13,3],[14,2,14,3],[16,2,16,3],[17,2,17,3],[15,2,15,3],[23,3,23,5],[24,3,24,5],[25,3,25,5],[31,3,31,5],[19,6,19,7],[30,3,30,5],[21,3,21,5],[26,3,26,5],[27,3,27,5],[28,3,28,5],[29,3,29,5],[51,3,51,5],[49,3,49,5],[35,3,35,5],[36,3,36,5],[34,3,34,5],[48,3,48,5],[45,3,45,5],[46,3,46,5],[47,3,47,5],[43,3,43,5],[44,3,44,5]]}
[null,null,null,null,null,null,null,"作成日",{"$f":"TODAY()","v":"2019-10-30"}]
[]
[null,null,null,null,null,"請求元　",{"$f":"\"取引先コード　\" & IF(入力様式!$O9=\"\",\"\",入力様式!$O9) & \"　\" & IF(入力様式!$D2=\"\",\"\",入力様式!$D2)","v":"取引先コード　　サンプル"}]
[null,null,null,null,null,null,{"$f":"\"〒\" & IF(入力様式!$O2=\"\",\"\",入力様式!$O2)","v":"〒"}]
["指定請求書",null,null,"2019-09-01",null,null,{"$f":"IF(入力様式!$O3=\"\",\"\",入力様式!$O3)","v":""}]
[null,null,null,null,null,null,{"$f":"IF(入力様式!$O4=\"\",\"\",入力様式!$O4)","v":""}]
[{"$f":"VLOOKUP(入力様式!O10,{0,\"\";1,\"〒910-3136\";2,\"〒912-0821\";3,\"〒321-4346\"},2,FALSE)","v":"〒910-3136"},null,null,null,null,null,{"$f":"IF(入力様式!$O5=\"\",\"\",入力様式!$O5)","v":""}]
[{"$f":"VLOOKUP(入力様式!O10,{0,\"\";1,\"福井県福井市川尻町第40号126番地1\";2,\"福井県大野市七板40字1\";3,\"栃木県真岡市松山町26番1\"},2,FALSE)","v":"福井県福井市川尻町第40号126番地1"},null,null,null,null,null,{"$f":"IF(入力様式!$O6=\"\",\"\",入力様式!$O6)","v":""}]
[null,null,null,null,null,null,{"$f":"IF(入力様式!$O7=\"\",\"\",\"(TEL) \" & 入力様式!$O7)","v":""}]
["ファーストウッド株式会社",null,null,"御中",null,null,{"$f":"IF(入力様式!$O8=\"\",\"\",\"(FAX) \" & 入力様式!$O8)","v":""}]
[null,null,"財務部"]
[null,null,null,null,null,"振込先①",{"$f":"IF(入力様式!$J$2=\"\",\"\",入力様式!$J$2) & \"　\" & IF(入力様式!$J$3=\"\",\"\",入力様式!$J$3)","v":"　"}]
[null,null,null,null,null,null,{"$f":"IF(入力様式!$L$4=\"\",\"\",\"（\" & 入力様式!$L$4 & \"）\") & DBCS(入力様式!$J$5)","v":"（普通）"}]
[null,"請求金額",{"$f":"IF(SUM(C55:D58)=0,\"\",SUM(C55:D58))","v":""},null,null,null,{"$f":"\"口座名義　\" & 入力様式!$J$6","v":"口座名義　"}]
[null,"消費税",{"$f":"IF(SUM(E55:F58)=0,\"\",SUM(SUM(E55:F58)))","v":""},null,null,"振込先②",{"$f":"IF(入力様式!$J$8=\"\",\"\",入力様式!$J$8) & \"　\" & IF(入力様式!$J$9=\"\",\"\",入力様式!$J$9)","v":"　"}]
[null,"調整額",{"$f":"IF($N57=\"\",\"\",N57)","v":0},null,null,null,{"$f":"IF(入力様式!$L$10=\"\",\"\",\"（\" & 入力様式!$L$10 & \"）\") & DBCS(入力様式!$J$11)","v":""}]
[null,"今回計",{"$f":"IF(N59=\"\",\"\",N59)","v":""},null,null,"振込先③",{"$f":"IF(入力様式!$J$13=\"\",\"\",入力様式!$J$13) & \"　\" & IF(入力様式!$J$14=\"\",\"\",入力様式!$J$14)","v":"　"}]
[null,"繰越金額",{"$f":"IF(I20=\"\",\"\",I20)","v":0},null,null,null,{"$f":"IF(入力様式!$L$15=\"\",\"\",\"（\" & 入力様式!$L$15 & \"）\") & DBCS(入力様式!$J$16)","v":""}]
[null,"合計",{"$f":"IF(C17=\"\",0,C17)+IF(C18=\"\",0,C18)","v":0}]
[null,null,null,null,null,null,"前月繰越金額",null,0]
[]
["日付","伝票№","納入部署","品名",null,null,"数量","単価","金額",null,"備考"]
[null,"",null,null,null,null,null,null,null,null,""]
[null,"",null,null,null,null,null,null,null,null,""]
[null,"",null,null,null,null,null,null,null,null,""]
[null,"",null,null,null,null,null,null,null,null,""]
[null,"",null,null,null,null,null,null,null,null,""]
[null,"",null,null,null,null,null,null,null,null,""]
[null,"",null,null,null,null,null,null,null,null,""]
[null,"",null,null,null,null,null,null,null,null,""]
{"$rows_left_out":31}
{"sheet":"データベース","index":3,"n_rows":5003,"n_cols":62,"rows_kept":5003,"cut":false,"hidden":true,"merged":[]}
[1,null,null,null,"発注部門","件名","伝票番号","納入部署","年","月","日","品名1","数量1","課税1","単価1","備考1","品名2","数量2","課税2","単価2","備考2","品名3","数量3","課税3","単価3","備考3","品名4","数量4","課税4","単価4","備考4","品名5","数量5","課税5","単価5","備考5","品名6","数量6","課税6","単価6","備考6","品名7","数量7","課税7","単価7","備考7","品名8","数量8","課税8","単価8","備考8","品名9","数量9","課税9","単価9","備考9","品名10","数量10","課税10","単価10","備考10","取引先code"]
[{"$f":"COUNTA(E4:E5003)","v":1},"呼出DATA",{"$f":"CONCATENATE(I2,\"/\",IF(LEN(J2)=1,0&J2,J2),\"/\",IF(LEN(K2)=1,0&K2,K2),\"　\",F2,\" \",L2,M2,\"個\",\"他\")","v":"2019/09/01　サンプル サンプル1個他"},null,{"$f":"IF($A$1<=5000,VLOOKUP($A$1,$B$4:$BI$1003,4),\"\")","v":"サンプル"},{"$f":"IF($A$1<=5000,IF(VLOOKUP($A$1,$B$4:$BI$1003,5)=0,\"\",VLOOKUP($A$1,$B$4:$BI$1003,5)),\"\")","v":"サンプル"},{"$f":"IF($A$1<=5000,VLOOKUP($A$1,$B$4:$BI$1003,6),\"\")","v":"0123-4567-8901"},{"$f":"IF($A$1<=5000,VLOOKUP($A$1,$B$4:$BI$1003,7),\"\")","v":"サンプル"},{"$f":"IF($A$1<=5000,VLOOKUP($A$1,$B$4:$BI$1003,8),YEAR(TODAY()))","v":2019},{"$f":"IF($A$1<=5000,VLOOKUP($A$1,$B$4:$BI$1003,9),MONTH(TODAY()))","v":9},{"$f":"IF($A$1<=5000,VLOOKUP($A$1,$B$4:$BI$1003,10),DAY(TODAY()))","v":1},{"$f":"IF($A$1<=5000,VLOOKUP($A$1,$B$4:$BI$1003,11),\"\")","v":"サンプル"},{"$f":"IF($A$1<=5000,VLOOKUP($A$1,$B$4:$BI$1003,12),0)","v":1},{"$f":"IF($A$1<=5000,IF(VLOOKUP($A$1,$B$4:$BI$1003,13)=0,\"\",VLOOKUP($A$1,$B$4:$BI$1003,13)),\"\")","v":""},{"$f":"IF($A$1<=5000,VLOOKUP($A$1,$B$4:$BI$1003,14),0)","v":1000},{"$f":"IF($A$1<=5000,IF(VLOOKUP($A$1,$B$4:$BI$1003,15)=0,\"\",VLOOKUP($A$1,$B$4:$BI$1003,15)),\"\")","v":""},{"$f":"IF($A$1<=5000,VLOOKUP($A$1,$B$4:$BI$1003,16),\"\")","v":"サンプル"},{"$f":"IF($A$1<=5000,VLOOKUP($A$1,$B$4:$BI$1003,17),0)","v":2},{"$f":"IF($A$1<=5000,IF(VLOOKUP($A$1,$B$4:$BI$1003,18)=0,\"\",VLOOKUP($A$1,$B$4:$BI$1003,18)),\"\")","v":""},{"$f":"IF($A$1<=5000,VLOOKUP($A$1,$B$4:$BI$1003,19),0)","v":10},{"$f":"IF($A$1<=5000,IF(VLOOKUP($A$1,$B$4:$BI$1003,20)=0,\"\",VLOOKUP($A$1,$B$4:$BI$1003,20)),\"\")","v":""},{"$f":"IF($A$1<=5000,VLOOKUP($A$1,$B$4:$BI$1003,21),\"\")","v":"サンプル"},{"$f":"IF($A$1<=5000,VLOOKUP($A$1,$B$4:$BI$1003,22),0)","v":3},{"$f":"IF($A$1<=5000,IF(VLOOKUP($A$1,$B$4:$BI$1003,23)=0,\"\",VLOOKUP($A$1,$B$4:$BI$1003,23)),\"\")","v":""},{"$f":"IF($A$1<=5000,VLOOKUP($A$1,$B$4:$BI$1003,24),0)","v":10},{"$f":"IF($A$1<=5000,IF(VLOOKUP($A$1,$B$4:$BI$1003,25)=0,\"\",VLOOKUP($A$1,$B$4:$BI$1003,25)),\"\")","v":""},{"$f":"IF($A$1<=5000,VLOOKUP($A$1,$B$4:$BI$1003,26),\"\")","v":"サンプル"},{"$f":"IF($A$1<=5000,VLOOKUP($A$1,$B$4:$BI$1003,27),0)","v":4},{"$f":"IF($A$1<=5000,IF(VLOOKUP($A$1,$B$4:$BI$1003,28)=0,\"\",VLOOKUP($A$1,$B$4:$BI$1003,28)),\"\")","v":""},{"$f":"IF($A$1<=5000,VLOOKUP($A$1,$B$4:$BI$1003,29),0)","v":10},{"$f":"IF($A$1<=5000,IF(VLOOKUP($A$1,$B$4:$BI$1003,30)=0,\"\",VLOOKUP($A$1,$B$4:$BI$1003,30)),\"\")","v":""},{"$f":"IF($A$1<=5000,VLOOKUP($A$1,$B$4:$BI$1003,31),\"\")","v":"サンプル"},{"$f":"IF($A$1<=5000,VLOOKUP($A$1,$B$4:$BI$1003,32),0)","v":5},{"$f":"IF($A$1<=5000,IF(VLOOKUP($A$1,$B$4:$BI$1003,33)=0,\"\",VLOOKUP($A$1,$B$4:$BI$1003,33)),\"\")","v":""},{"$f":"IF($A$1<=5000,VLOOKUP($A$1,$B$4:$BI$1003,34),0)","v":10},{"$f":"IF($A$1<=5000,IF(VLOOKUP($A$1,$B$4:$BI$1003,35)=0,\"\",VLOOKUP($A$1,$B$4:$BI$1003,35)),\"\")","v":""},{"$f":"IF($A$1<=5000,VLOOKUP($A$1,$B$4:$BI$1003,36),\"\")","v":"サンプル"},{"$f":"IF($A$1<=5000,VLOOKUP($A$1,$B$4:$BI$1003,37),0)","v":6},{"$f":"IF($A$1<=5000,IF(VLOOKUP($A$1,$B$4:$BI$1003,38)=0,\"\",VLOOKUP($A$1,$B$4:$BI$1003,38)),\"\")","v":""},{"$f":"IF($A$1<=5000,VLOOKUP($A$1,$B$4:$BI$1003,39),0)","v":10},{"$f":"IF($A$1<=5000,IF(VLOOKUP($A$1,$B$4:$BI$1003,40)=0,\"\",VLOOKUP($A$1,$B$4:$BI$1003,40)),\"\")","v":""},{"$f":"IF($A$1<=5000,VLOOKUP($A$1,$B$4:$BI$1003,41),\"\")","v":"サンプル"},{"$f":"IF($A$1<=5000,VLOOKUP($A$1,$B$4:$BI$1003,42),0)","v":7},{"$f":"IF($A$1<=5000,IF(VLOOKUP($A$1,$B$4:$BI$1003,43)=0,\"\",VLOOKUP($A$1,$B$4:$BI$1003,43)),\"\")","v":""},{"$f":"IF($A$1<=5000,VLOOKUP($A$1,$B$4:$BI$1003,44),0)","v":10},{"$f":"IF($A$1<=5000,IF(VLOOKUP($A$1,$B$4:$BI$1003,45)=0,\"\",VLOOKUP($A$1,$B$4:$BI$1003,45)),\"\")","v":""},{"$f":"IF($A$1<=5000,VLOOKUP($A$1,$B$4:$BI$1003,46),\"\")","v":"サンプル"},{"$f":"IF($A$1<=5000,VLOOKUP($A$1,$B$4:$BI$1003,47),0)","v":8},{"$f":"IF($A$1<=5000,IF(VLOOKUP($A$1,$B$4:$BI$1003,48)=0,\"\",VLOOKUP($A$1,$B$4:$BI$1003,48)),\"\")","v":""},{"$f":"IF($A$1<=5000,VLOOKUP($A$1,$B$4:$BI$1003,49),0)","v":10},{"$f":"IF($A$1<=5000,IF(VLOOKUP($A$1,$B$4:$BI$1003,50)=0,\"\",VLOOKUP($A$1,$B$4:$BI$1003,50)),\"\")","v":""},{"$f":"IF($A$1<=5000,VLOOKUP($A$1,$B$4:$BI$1003,51),\"\")","v":"サンプル"},{"$f":"IF($A$1<=5000,VLOOKUP($A$1,$B$4:$BI$1003,52),0)","v":9},{"$f":"IF($A$1<=5000,IF(VLOOKUP($A$1,$B$4:$BI$1003,53)=0,\"\",VLOOKUP($A$1,$B$4:$BI$1003,53)),\"\")","v":""},{"$f":"IF($A$1<=5000,VLOOKUP($A$1,$B$4:$BI$1003,54),0)","v":10},{"$f":"IF($A$1<=5000,IF(VLOOKUP($A$1,$B$4:$BI$1003,55)=0,\"\",VLOOKUP($A$1,$B$4:$BI$1003,55)),\"\")","v":""},{"$f":"IF($A$1<=5000,VLOOKUP($A$1,$B$4:$BI$1003,56),\"\")","v":"サンプル"},{"$f":"IF($A$1<=5000,VLOOKUP($A$1,$B$4:$BI$1003,57),0)","v":10},{"$f":"IF($A$1<=5000,IF(VLOOKUP($A$1,$B$4:$BI$1003,58)=0,\"\",VLOOKUP($A$1,$B$4:$BI$1003,58)),\"\")","v":""},{"$f":"IF($A$1<=5000,VLOOKUP($A$1,$B$4:$BI$1003,59),0)","v":10},{"$f":"IF($A$1<=5000,IF(VLOOKUP($A$1,$B$4:$BI$1003,60)=0,\"\",VLOOKUP($A$1,$B$4:$BI$1003,60)),\"\")","v":""},{"$f":"IF($A$1<=5000,IF(VLOOKUP($A$1,$B$4:$BJ$1003,61)=0,\"\",VLOOKUP($A$1,$B$4:$BJ$1003,61)),\"\")","v":1}]
[1,"入力DATA",{"$f":"CONCATENATE(I3,\"/\",IF(LEN(J3)=1,0&J3,J3),\"/\",IF(LEN(K3)=1,0&K3,K3),\"　\",F3,\" \",L3,M3,\"個\",\"他\")","v":"2019/09/01　サンプル サンプル1個他"},null,"サンプル","サンプル","0123-4567-8901","サンプル",2019,9,1,"サンプル",1,"",1000,"","サンプル",2,"",10,"","サンプル",3,"",10,"","サンプル",4,"",10,"","サンプル",5,"",10,"","サンプル",6,"",10,"","サンプル",7,"",10,"","サンプル",8,"",10,"","サンプル",9,"",10,"","サンプル",10,"",10,"",1]
[null,1,{"$f":"CONCATENATE(I4,\"/\",IF(LEN(J4)=1,0&J4,J4),\"/\",IF(LEN(K4)=1,0&K4,K4),\"　\",F4,\" \",L4,M4,\"個\",\"他\")","v":"2019/09/01　サンプル サンプル1個他"},null,"サンプル","サンプル","0123-4567-8901","サンプル",2019,9,1,"サンプル",1,null,1000,null,"サンプル",2,null,10,null,"サンプル",3,null,10,null,"サンプル",4,null,10,null,"サンプル",5,null,10,null,"サンプル",6,null,10,null,"サンプル",7,null,10,null,"サンプル",8,null,10,null,"サンプル",9,null,10,null,"サンプル",10,null,10,null,1]
[null,2,"//　 個他",null,null,null,null,null,null,null,null,null,null,null,null,null,null,null,null,null,null,null,null,null,null,null,null,null,null,null,null,null,null,null,null,null,null,null,null,null,null,null,null,null,null,null,null,null,null,null,null,null,null,null,null,null,null,null,null,null,null,1]
[null,{"$f":"B5+1","v":3},"//　 個他",null,null,null,null,null,null,null,null,null,null,null,null,null,null,null,null,null,null,null,null,null,null,null,null,null,null,null,null,null,null,null,null,null,null,null,null,null,null,null,null,null,null,null,null,null,null,null,null,null,null,null,null,null,null,null,null,null,null,1]
[null,{"$f":"B6+1","v":4},{"$f":"CONCATENATE(I7,\"/\",IF(LEN(J7)=1,0&J7,J7),\"/\",IF(LEN(K7)=1,0&K7,K7),\"　\",F7,\" \",L7,M7,\"個\",\"他\")","v":"//　 個他"},null,null,null,null,null,null,null,null,null,null,null,null,null,null,null,null,null,null,null,null,null,null,null,null,null,null,null,null,null,null,null,null,null,null,null,null,null,null,null,null,null,null,null,null,null,null,null,null,null,null,null,null,null,null,null,null,null,null,1]
[null,5,"//　 個他",null,null,null,null,null,null,null,null,null,null,null,null,null,null,null,null,null,null,null,null,null,null,null,null,null,null,null,null,null,null,null,null,null,null,null,null,null,null,null,null,null,null,null,null,null,null,null,null,null,null,null,null,null,null,null,null,null,null,""]
[null,6,"//　 個他",null,null,null,null,null,null,null,null,null,null,null,null,null,null,null,null,null,null,null,null,null,null,null,null,null,null,null,null,null,null,null,null,null,null,null,null,null,null,null,null,null,null,null,null,null,null,null,null,null,null,null,null,null,null,null,null,null,null,""]
[null,7,"//　 個他",null,null,null,null,null,null,null,null,null,null,null,null,null,null,null,null,null,null,null,null,null,null,null,null,null,null,null,null,null,null,null,null,null,null,null,null,null,null,null,null,null,null,null,null,null,null,null,null,null,null,null,null,null,null,null,null,null,null,""]
[null,8,"//　 個他",null,null,null,null,null,null,null,null,null,null,null,null,null,null,null,null,null,null,null,null,null,null,null,null,null,null,null,null,null,null,null,null,null,null,null,null,null,null,null,null,null,null,null,null,null,null,null,null,null,null,null,null,null,null,null,null,null,null,""]
[null,9,"//　 個他",null,null,null,null,null,null,null,null,null,null,null,null,null,null,null,null,null,null,null,null,null,null,null,null,null,null,null,null,null,null,null,null,null,null,null,null,null,null,null,null,null,null,null,null,null,null,null,null,null,null,null,null,null,null,null,null,null,null,""]
[null,10,"//　 個他",null,null,null,null,null,null,null,null,null,null,null,null,null,null,null,null,null,null,null,null,null,null,null,null,null,null,null,null,null,null,null,null,null,null,null,null,null,null,null,null,null,null,null,null,null,null,null,null,null,null,null,null,null,null,null,null,null,null,""]
[null,11,"//　 個他",null,null,null,null,null,null,null,null,null,null,null,null,null,null,null,null,null,null,null,null,null,null,null,null,null,null,null,null,null,null,null,null,null,null,null,null,null,null,null,null,null,null,null,null,null,null,null,null,null,null,null,null,null,null,null,null,null,null,""]
[null,12,"//　 個他"]
[null,13,"//　 個他"]
[null,14,"//　 個他"]
[null,15,"//　 個他"]
[null,16,"//　 個他"]
[null,17,"//　 個他"]
[null,18,"//　 個他"]
[null,19,"//　 個他"]
[null,20,"//　 個他"]
[null,21,"//　 個他"]
[null,22,"//　 個他"]
[null,23,"//　 個他"]
[null,24,"//　 個他"]
[null,25,"//　 個他"]
[null,26,"//　 個他"]
[null,27,"//　 個他"]
{"$rows_left_out":4974}
{"sheet":"処理シート","index":4,"n_rows":10,"n_cols":22,"rows_kept":10,"cut":false,"hidden":true,"merged":[]}
[2019,"2019-09-01","0123-4567-8901","サンプル","サンプル","",1,1000,1000,"","-4567-89012019/09/01　サンプル サンプル1個他","2019/09/01　サンプル サンプル1個他","2019-09-01","0123-4567-8901","サンプル","サンプル","",1,1000,1000,"","-4567-89012019/09/01　サンプル サンプル1個他"]
[9,"2019-09-01","0123-4567-8901","サンプル","サンプル","",2,10,20,"","-4567-89012019/09/01　サンプル サンプル1個他","2019/09/01　サンプル サンプル1個他","2019-09-01","0123-4567-8901","サンプル","サンプル","",2,10,20,"","-4567-89012019/09/01　サンプル サンプル1個他"]
["サンプル","2019-09-01","0123-4567-8901","サンプル","サンプル","",3,10,30,"","-4567-89012019/09/01　サンプル サンプル1個他","2019/09/01　サンプル サンプル1個他","2019-09-01","0123-4567-8901","サンプル","サンプル","",3,10,30,"","-4567-89012019/09/01　サンプル サンプル1個他"]
[{"$f":"COUNTA(B:B)","v":10},"2019-09-01","0123-4567-8901","サンプル","サンプル","",4,10,40,"","-4567-89012019/09/01　サンプル サンプル1個他","2019/09/01　サンプル サンプル1個他","2019-09-01","0123-4567-8901","サンプル","サンプル","",4,10,40,"","-4567-89012019/09/01　サンプル サンプル1個他"]
[null,"2019-09-01","0123-4567-8901","サンプル","サンプル","",5,10,50,"","-4567-89012019/09/01　サンプル サンプル1個他","2019/09/01　サンプル サンプル1個他","2019-09-01","0123-4567-8901","サンプル","サンプル","",5,10,50,"","-4567-89012019/09/01　サンプル サンプル1個他"]
[null,"2019-09-01","0123-4567-8901","サンプル","サンプル","",6,10,60,"","-4567-89012019/09/01　サンプル サンプル1個他","2019/09/01　サンプル サンプル1個他","2019-09-01","0123-4567-8901","サンプル","サンプル","",6,10,60,"","-4567-89012019/09/01　サンプル サンプル1個他"]
[null,"2019-09-01","0123-4567-8901","サンプル","サンプル","",7,10,70,"","-4567-89012019/09/01　サンプル サンプル1個他","2019/09/01　サンプル サンプル1個他","2019-09-01","0123-4567-8901","サンプル","サンプル","",7,10,70,"","-4567-89012019/09/01　サンプル サンプル1個他"]
[null,"2019-09-01","0123-4567-8901","サンプル","サンプル","",8,10,80,"","-4567-89012019/09/01　サンプル サンプル1個他","2019/09/01　サンプル サンプル1個他","2019-09-01","0123-4567-8901","サンプル","サンプル","",8,10,80,"","-4567-89012019/09/01　サンプル サンプル1個他"]
[null,"2019-09-01","0123-4567-8901","サンプル","サンプル","",9,10,90,"","-4567-89012019/09/01　サンプル サンプル1個他","2019/09/01　サンプル サンプル1個他","2019-09-01","0123-4567-8901","サンプル","サンプル","",9,10,90,"","-4567-89012019/09/01　サンプル サンプル1個他"]
[null,"2019-09-01","0123-4567-8901","サンプル","サンプル","",10,10,100,"","-4567-89012019/09/01　サンプル サンプル1個他","2019/09/01　サンプル サンプル1個他","2019-09-01","0123-4567-8901","サンプル","サンプル","",10,10,100,"","-4567-89012019/09/01　サンプル サンプル1個他"]

{"sheet":"短縮","index":5,"n_rows":101,"n_cols":16,"rows_kept":101,"cut":false,"hidden":true,"merged":[]}
["№","品名","消費税課税",null,null,null,"№","発注部門","取引先コード",null,"№","伝票件名","伝票番号",null,"№","納入部署"]
[1,"サンプル",null,null,null,null,1,"サンプル",1,null,1,null,null,null,1,"集成材"]
[2,null,null,null,null,null,2,null,null,null,2,null,null,null,2,"プレカット"]
[3,null,null,null,null,null,3,null,null,null,3,null,null,null,3,"製材"]
[4,null,null,null,null,null,4,null,null,null,4,null,null,null,4,"総務"]
[5,null,null,null,null,null,5,null,null,null,5,null,null,null,5,"営繕"]
[6,null,null,null,null,null,6,null,null,null,6,null,null,null,6,"安全"]
[7,null,null,null,null,null,7,null,null,null,7,null,null,null,7]
[8,null,null,null,null,null,8,null,null,null,8,null,null,null,8]
[9,null,null,null,null,null,9,null,null,null,9,null,null,null,9]
[10,null,null,null,null,null,10,null,null,null,10,null,null,null,10]
[11,null,null,null,null,null,11,null,null,null,11,null,null,null,11]
[12,null,null,null,null,null,12,null,null,null,12,null,null,null,12]
[13,null,null,null,null,null,13,null,null,null,13,null,null,null,13]
[14,null,null,null,null,null,14,null,null,null,14,null,null,null,14]
[15,null,null,null,null,null,15,null,null,null,15,null,null,null,15]
[16,null,null,null,null,null,16,null,null,null,16,null,null,null,16]
[17,null,null,null,null,null,17,null,null,null,17,null,null,null,17]
[18,null,null,null,null,null,18,null,null,null,18,null,null,null,18]
[19,null,null,null,null,null,19,null,null,null,19,null,null,null,19]
[20,null,null,null,null,null,20,null,null,null,20,null,null,null,20]
[21,null,null,null,null,null,21,null,null,null,21,null,null,null,21]
[22,null,null,null,null,null,22,null,null,null,22,null,null,null,22]
[23,null,null,null,null,null,23,null,null,null,23,null,null,null,23]
[24,null,null,null,null,null,24,null,null,null,24,null,null,null,24]
[25,null,null,null,null,null,25,null,null,null,25,null,null,null,25]
[26,null,null,null,null,null,26,null,null,null,26,null,null,null,26]
[27,null,null,null,null,null,27,null,null,null,27,null,null,null,27]
[28,null,null,null,null,null,28,null,null,null,28,null,null,null,28]
[29,null,null,null,null,null,29,null,null,null,29,null,null,null,29]
{"$rows_left_out":71}